{"text_format":"1","workbook":"xlsx","n_sheets":3,"sheets":["Forside","Renovering","NyBygTilByg"],"not_rendered":{"charts":0,"images":0,"macros":1,"external_links":0,"defined_names":1,"comments":0,"pivot_tables":0},"unopened":[],"bounds":{"document_bytes":16777216,"sheet_cells":100000,"rows_first":2000,"rows_last":500,"rows_between":2000,"halvings":0,"cell_chars":16384,"cell_head_chars":4096},"cells_cut":0,"cells_raw":0,"read":"whole","date_system":"1900"}

{"sheet":"Forside","index":0,"n_rows":47,"n_cols":15,"rows_kept":47,"cut":false,"hidden":false,"merged":[[16,1,17,2],[6,13,7,20]]}
[null,"Forside"]
[null,"- Denne model har til hensigt at illustrere prioriteringen af \" Modernisering af kvægstalde 2016\""]
[]
[]
[]
[null,null,null,null,null,null,null,null,null,null,null,null,null,"For at modellen kan anvendes skal \"indhold\" aktiveres. Se gul boks øverst på siden ved åbning."]
[null,null,null,null,null,null,null,null,null,null,null,null,null,"Vejledning for brug af beregningseksempler"]
[]
[null,null,null,null,null,null,null,null,null,null,null,null,null,"1. Forside"]
[null,null,"Vælg Indsatsområde",null,null,null,null,null,null,"NyByg",null,null,null,null,"1.1 Vælg først indsatsområde ved at trykke på den relevante knap"]
[null,null,null,null,null,null,null,null,null,null,null,null,null,null,"1.2 Vælg derefter om der er tale om konventionel eller "]
[null,null,"Vælg økologisk / Konventionel",null,null,"Konventionel","Økologisk",null,null,"Konventionel",null,null,null,null,"økologisk bedrift"]
[null,null,null,null,null,null,null,null,null,null,null,null,null,null,"1.3 Hvis der i ansøgningen skal ansøges til slagtekalve eller opdræt"]
[null,null,null,null,null,null,null,null,null,null,null,null,null,null,"skal der i de to gule felter indtastes fordelingen imellem de to. "]
[null,null,"Indtast antallet af husdyrpladser somder bygges til eller renoveres til",null,null,null,"Standardpris","Total Værdi ",null,null,null,null,null,null,"Fordelingen imellem de to skal summe til 100%"]
[null,null,null,"Malkekøer - Født fra antallet af kopladser",null,{"$f":"IF($J$10=\"Renovering\",Renovering!AE15,NyBygTilByg!AE15)","v":0},5770,{"$f":"G16*F16","v":0},null,null,null,null,null,null,"1.4 Tryk derefter på næste og kom videre til næste side"]
[null,"Fordeling af ungdyr",null,"Slagtekalve - %",null,{"$f":"IF($J$10=\"Renovering\",Renovering!AE16,NyBygTilByg!AE16)","v":0},450,{"$f":"G17*F17","v":0},null,null,null,null,null,"2. Indsatsområdet"]
[null,null,null,"Opdræt - %",null,{"$f":"IF($J$10=\"Renovering\",Renovering!AE17,NyBygTilByg!AE17)","v":0},950,0,null,null,null,null,null,null,"2.1 Antallet af de forskellige typer af ko - eller ungdyrspladser, som der søges"]
[null,null,null,null,null,{"$f":"IF(AND(SUM(E17:E18)<>1,SUM(E17:E18)<>0),\"FEJL - Fordelingen af ungdyr skal enten være 0 eller 100%\",\"\")","v":""},null,null,null,null,null,null,null,null,"tilskud til indtastes under basisstald. Antallet af pladser udgør"]
[null,null,"Gå til ansøgningsskema",null,null,{"$f":"IF(AND(J10<>\"Renovering\",F19=\"\"),\"Næste\",\"\")","v":"Næste"},{"$f":"IF(AND(J10=\"Renovering\",F19=\"\"),\"Næste\",\"\")","v":""},null,null,null,null,null,null,null,"grundlaget for beregningen af økonomisk værdi. Det er kun "]
[null,null,null,null,null,null,null,null,null,null,null,null,null,null,"muligt at indtaste ungdyrspladser hvis fordelingen indtastet"]
[null,null,null,null,null,null,null,null,null,null,null,null,null,null,"på forsiden summerer til 100%"]
[null,null,null,null,null,null,null,null,null,null,null,null,null,null,"2.2 Udover basistald elementer, kan der søges om tilskud til teknologier"]
[null,null,null,null,null,null,null,null,null,null,null,null,null,null,"under Miljø- og dyrevelfærdstilkøb og Malkning- og mælkeopbevaring"]
[null,null,null,null,null,null,null,null,null,null,null,null,null,null,"Den økonomiske værdi øges mellem 0 - 5 % for den del af ansøgningen"]
[null,null,null,null,null,null,null,null,null,null,null,null,null,null,"som teknologien dækker. For mere information kan kapaciteten og "]
[null,null,null,null,null,null,null,null,null,null,null,null,null,null,"den økonomiske effekt for hver enkelt teknologi findes i bilag 1"]
[null,null,null,null,null,null,null,null,null,null,null,null,null,null,"i vejledningen"]
[null,null,null,null,null,null,null,null,null,null,null,null,null,null,"2.3 Den faste pris, som er fastsat for hvert enkelt element, kan"]
[null,null,null,null,null,null,null,null,null,null,null,null,null,null,"nedskrives for samtlige teknologier og elementer."]
{"$rows_left_out":18}
{"sheet":"Renovering","index":1,"n_rows":89,"n_cols":34,"rows_kept":89,"cut":false,"hidden":false,"merged":[[44,1,44,3],[62,1,62,3],[81,1,81,3],[14,1,14,3],[29,1,29,3]]}
[]
[null,null,null,null,{"$f":"IF(Forside!J10<>\"Renovering\",\"DENNE DEL KAN IKKE IKKE BRUGES NU\",Forside!J10&\" - \"&Forside!J12)","v":"DENNE DEL KAN IKKE IKKE BRUGES NU"}]
[]
[]
[]
[]
["Gå tilbage til forsiden"]
[]
[]
[]
[]
[]
[]
[null,"Kontrol i skema","Kontrol i skema","Kontrol i skema",null,null,null,null,null,null,null,null,null,null,null,null,null,null,null,null,null,null,null,null,null,null,null,null,null,null,"Antal kopladser","Standardpris","Total Værdi ","Vægtetning af pladser"]
[null,"Elementernes anvendelse",null,null,"Basis staldanlæg - Niveau 1",null,null,null,null,null,null,null,null,null,null,null,null,null,null,null,null,null,null,null,null,null,null,null,null,"Malkekøer",{"$f":"SUM(H17:H20)+SUM(H32:H37)+SUM(H47:H54)","v":100},{"$f":"Forside!G16","v":5770},{"$f":"AE15*AF15","v":577000},{"$f":"AE15/SUM($AE$15:$AE$17)","v":1}]
[null,"Malkekøer","Slagtekalve","Opdræt","Kategori/element","Fast Pris","Enhed","Angiv Stk.","Enheder pr. koplads","Enheder pr. Slagtekalve","Enheder pr. Opdræt",null,"Procent af malkekøer dækket","Procent af slagtekalve dækket","Procent af opdræt dækket","Malkekøer dækket","Slagtekalve dækket","Opdræt dækket","Værdi beregnet","Lavere tilbudspris",null,null,null,null,"Total Pris beregnet","Total pris",null,null,null,"Slagtekalve",{"$f":"(SUM(H21:H23)+SUM(H38:H42)+SUM(H55:H59))*Forside!E17","v":0},{"$f":"Forside!G17","v":450},{"$f":"AE16*AF16","v":0},{"$f":"AE16/SUM($AE$15:$AE$17)","v":0}]
[null,"X",null,null,"Sengebåse til lakterende køer",11940,"Koplads",100,1,"Ikke relevant","Ikke relevant",null,{"$f":"IF($AE$15=0,0,IF(IF($H17=0,0,IF(I17=\"Ikke Relevant\",0,(($H17*$I17)*($AE$15/((IF($B17=\"X\",$AE$15,0))+(IF($C17=\"X\",$AE$16,0))+(IF($D17=\"X\",$AE$17,0))))/(IF($B17=\"X\",$AE$15,0)))))>1,1,IF($H17=0,0,IF(I17=\"Ikke Relevant\",0,(($H17*$I17)*($AE$15/((IF($B17=\"X\",$AE$15,0))+(IF($C17=\"X\",$AE$16,0))+(IF($D17=\"X\",$AE$17,0))))/(IF($B17=\"X\",$AE$15,0)))))))","v":1},{"$f":"IF($AE$16=0,0,IF(IF($H17=0,0,IF(J17=\"Ikke Relevant\",0,(($H17*$J17)*($AE$16/((IF($B17=\"X\",$AE$15,0))+(IF($C17=\"X\",$AE$16,0))+(IF($D17=\"X\",$AE$17,0))))/(IF($C17=\"X\",$AE$16,0)))))>1,1,IF($H17=0,0,IF(J17=\"Ikke Relevant\",0,(($H17*$J17)*($AE$16/((IF($B17=\"X\",$AE$15,0))+(IF($C17=\"X\",$AE$16,0))+(IF($D17=\"X\",$AE$17,0))))/(IF($C17=\"X\",$AE$16,0)))))))","v":0},{"$f":"IF($AE$17=0,0,IF(IF($H17=0,0,IF(J17=\"Ikke Relevant\",0,(($H17*$K17)*($AE$17/((IF($B17=\"X\",$AE$15,0))+(IF($C17=\"X\",$AE$16,0))+(IF($D17=\"X\",$AE$17,0))))/(IF($D17=\"X\",$AE$17,0)))))>1,1,IF($H17=0,0,IF(J17=\"Ikke Relevant\",0,(($H17*$K17)*($AE$17/((IF($B17=\"X\",$AE$15,0))+(IF($C17=\"X\",$AE$16,0))+(IF($D17=\"X\",$AE$17,0))))/(IF($D17=\"X\",$AE$17,0)))))))","v":0},{"$f":"IF($AE$15=0,0,M17*$AE$15)","v":100},{"$f":"IF($AE$16=0,0,N17*$AE$16)","v":0},{"$f":"IF($AE$17=0,0,O17*$AE$17)","v":0},{"$f":"(M17*$AG$15)+(N17*$AG$16)+(O17*$AG$17)","v":577000},null,null,null,null,null,{"$f":"F17*H17","v":1194000},{"$f":"IF(OR(T17=\"\",T17=0),Y17,T17)","v":1194000},null,null,null,"Opdræt",{"$f":"(SUM(H21:H23)+SUM(H38:H42)+SUM(H55:H59))*Forside!E18","v":0},{"$f":"Forside!G18","v":950},0,{"$f":"AE17/SUM($AE$15:$AE$17)","v":0}]
[null,"X",null,null,"Sengebåse til goldkøer",12418,"Koplads",null,1,"Ikke relevant","Ikke relevant",null,0,0,0,0,0,0,0,null,null,null,null,null,0,{"$f":"IF(OR(T18=\"\",T18=0),Y18,T18)","v":0}]
[null,"X",null,null,"Behandlingsfaciliteter – fælles (ekskl. klovbehandlingsboks)",6252,"Koplads",null,1,"Ikke relevant","Ikke relevant",null,0,0,0,0,0,0,0,null,null,null,null,null,0,0]
[null,"X",null,null,"Ændring af eksisterende bindestalde – køer",11940,"Koplads",null,1,"Ikke relevant","Ikke relevant",null,0,0,0,0,0,0,0,null,null,null,null,null,0,0]
[null,null,"X","X","Ændring af fuldspaltegulvbokse",7285,"Ungdyrplads",null,"Ikke Relevant",1,1,null,0,0,0,0,0,0,0,null,null,null,null,null,0,0,null,null,null,null,null,"Total pris for ansøgningen","Indtægt for ansøgning"]
[null,null,"X","X","Sengebåse til ungdyr",10746,"Ungdyrplads",null,"Ikke Relevant",1,1,null,0,0,0,0,0,0,0,null,null,null,null,null,0,0]
[null,null,"X","X","Ændring af eksisterende bindestalde – ungdyr",10746,"Ungdyrplads",null,"Ikke Relevant",1,1,null,0,0,0,0,0,0,0,null,null,null,null,null,0,0,null,null,null,"Basis Staldanlæg - niveau 1",null,{"$f":"Z27","v":1401400},{"$f":"S27","v":577000}]
[null,"X",null,null,"Ekstra staldkvadratmeter – Opsamlingsplads",2074,"m2",100,0,"Ikke relevant","Ikke relevant",null,0,0,0,0,0,0,0,null,null,null,null,null,207400,{"$f":"IF(OR(T24=\"\",T24=0),Y24,T24)","v":207400},null,null,null,"Basis Staldanlæg - niveau 2",null,{"$f":"Z43","v":0},{"$f":"S43","v":0}]
[null,"X",null,null,"Ekstra staldkvadratmeter – Malkestald",3500,"m2",null,0,"Ikke relevant","Ikke relevant",null,0,0,0,0,0,0,0,null,null,null,null,null,0,{"$f":"IF(OR(T25=\"\",T25=0),Y25,T25)","v":0},null,null,null,"Basis Staldanlæg - niveau 3",null,{"$f":"Z60","v":0},{"$f":"S60","v":0}]
[null,"X",null,null,"Ekstra staldkvadratmeter – Servicerum",5000,"m2",null,{"$f":"IF(H26>=100,$AE$15,((H26*$AE$15)/100))","v":0},"Ikke relevant","Ikke relevant",null,0,0,0,0,0,0,0,null,null,null,null,null,0,{"$f":"IF(OR(T26=\"\",T26=0),Y26,T26)","v":0},null,null,null,"Miljø- og dyrevelfærdstilkøb",null,{"$f":"Z80","v":0},{"$f":"W80+X80","v":0}]
[null,null,null,null,"Samlet pris for Basis Staldanlæg",null,null,null,null,null,null,null,null,null,null,null,null,null,{"$f":"SUM(S17:S23)","v":577000},null,null,null,null,null,null,{"$f":"SUMIF(Z17:Z26,\"<>Ikke relevant\",Z17:Z26)","v":1401400},null,null,null,"Malkning og mælkeopbevaring",null,{"$f":"Z89","v":0},0]
[null,null,null,null,null,null,null,null,null,null,null,null,null,null,null,null,null,null,null,null,null,null,null,null,null,null,null,null,null,"Total",null,{"$f":"SUM(AF23:AF27)","v":1401400},{"$f":"SUM(AG23:AG27)","v":577000}]
[null,null,null,null,null,null,null,null,null,null,null,null,null,null,null,null,null,null,null,null,null,null,null,null,null,null,null,null,null,"Ansøgt Beløb (20%)",null,{"$f":"AF28/5","v":280280}]
[null,"Elementernes anvendelse",null,null,"Basis staldanlæg - Niveau 2"]
{"$rows_left_out":60}
{"sheet":"NyBygTilByg","index":2,"n_rows":51,"n_cols":34,"rows_kept":51,"cut":false,"hidden":false,"merged":[[24,1,24,3],[20,29,20,33],[4,4,4,24],[43,4,43,24],[24,4,24,24]]}
[null,null,null,null,{"$f":"IF(Forside!J10=\"Renovering\",\"DENNE DEL KAN IKKE IKKE BRUGES NU\",Forside!J10&\" - \"&Forside!J12)","v":"NyByg - Konventionel"}]
[]
["Gå tilbage til forsiden"]
[]
[null,null,null,null,"Basis staldanlæg"]
[null,null,null,null,"Kategori/element","Pris","Enhed","Angiv Stk.",null,null,null,null,null,null,null,null,null,null,"Total Pris","Angiv lavere pris",null,null,null,null,"Endelig pris til prioritering"]
[null,null,null,null,"Sengebåse til lakterende køer",20035,{"$f":"VLOOKUP(E7,Renovering!E:G,3,0)","v":"Koplads"},null,null,null,null,null,null,null,null,null,null,null,{"$f":"IF(F7=\"Ikke Relevant\",\"Ikke Relevant\",F7*H7)","v":0},null,null,null,null,null,{"$f":"IF(AND(T7<S7,T7<>0,T7<>\"\"),T7,S7)","v":0}]
[null,null,null,null,"Sengebåse til goldkøer",20836,{"$f":"VLOOKUP(E8,Renovering!E:G,3,0)","v":"Koplads"},null,null,null,null,null,null,null,null,null,null,null,0,null,null,null,null,null,{"$f":"IF(AND(T8<S8,T8<>0,T8<>\"\"),T8,S8)","v":0}]
[null,null,null,null,"Dybstrøelsesstald, Fællesbokse til køer, minimum 8m2 pr. ko",20600,{"$f":"VLOOKUP(E9,Renovering!E:G,3,0)","v":"Koplads"},null,null,null,null,null,null,null,null,null,null,null,0,null,null,null,null,null,0]
[null,null,null,null,"Fællesbokse til køer, kælving, minimum 8m2 pr. ko",20600,{"$f":"VLOOKUP(E10,Renovering!E:G,3,0)","v":"Koplads"},null,null,null,null,null,null,null,null,null,null,null,0,null,null,null,null,null,0]
[null,null,null,null,"Enkeltbokse - kælving -  min. 12 m2/ko",30900,{"$f":"VLOOKUP(E11,Renovering!E:G,3,0)","v":"Koplads"},null,null,null,null,null,null,null,null,null,null,null,0,null,null,null,null,null,0]
[null,null,null,null,"Behandlingsfaciliteter – fælles (ekskl. klovbehandlingsboks)",11955,{"$f":"VLOOKUP(E12,Renovering!E:G,3,0)","v":"Koplads"},null,null,null,null,null,null,null,null,null,null,null,{"$f":"IF(F12=\"Ikke Relevant\",\"Ikke Relevant\",F12*H12)","v":0},null,null,null,null,null,{"$f":"IF(AND(T12<S12,T12<>0,T12<>\"\"),T12,S12)","v":0}]
[null,null,null,null,"Enkeltbokse -sygdomsbehandling-  min. 12 m2/ko",30900,{"$f":"VLOOKUP(E13,Renovering!E:G,3,0)","v":"Koplads"},null,null,null,null,null,null,null,null,null,null,null,{"$f":"IF(F13=\"Ikke Relevant\",\"Ikke Relevant\",F13*H13)","v":0},null,null,null,null,null,{"$f":"IF(AND(T13<S13,T13<>0,T13<>\"\"),T13,S13)","v":0}]
[null,null,null,null,"Pladser til kalve 0-3 mdr. i hytter/enkeltbokse og 3-6 mdr. i fællesbokse",13285,{"$f":"VLOOKUP(E14,Renovering!E:G,3,0)","v":"Ungdyrsplads"},null,null,null,null,null,null,null,null,null,null,null,{"$f":"IF(F14=\"Ikke Relevant\",\"Ikke Relevant\",F14*H14)","v":0},null,null,null,null,null,{"$f":"IF(AND(T14<S14,T14<>0,T14<>\"\"),T14,S14)","v":0},null,null,null,null,null,"Antal kopladser","Standardpris","½"]
[null,null,null,null,"Sengebåse til ungdyr",18032,{"$f":"VLOOKUP(E15,Renovering!E:G,3,0)","v":"Ungdyrplads"},null,null,null,null,null,null,null,null,null,null,null,{"$f":"IF(F15=\"Ikke Relevant\",\"Ikke Relevant\",F15*H15)","v":0},null,null,null,null,null,{"$f":"IF(AND(T15<S15,T15<>0,T15<>\"\"),T15,S15)","v":0},null,null,null,null,"Malkekøer",{"$f":"SUM(H7:H13)","v":0},{"$f":"Forside!G16","v":5770},{"$f":"AE15*AF15","v":0}]
[null,null,null,null,"Dybstrøelsesstald - Fællesbokse til ungdyr",15000,{"$f":"VLOOKUP(E16,Renovering!E:G,3,0)","v":"Ungdyrsplads"},null,null,null,null,null,null,null,null,null,null,null,{"$f":"IF(F16=\"Ikke Relevant\",\"Ikke Relevant\",F16*H16)","v":0},null,null,null,null,null,{"$f":"IF(AND(T16<S16,T16<>0,T16<>\"\"),T16,S16)","v":0},null,null,null,null,"Slagtekalve",{"$f":"SUM(H14:H17)*Forside!E17","v":0},{"$f":"Forside!G17","v":450},{"$f":"AE16*AF16","v":0}]
[null,null,null,null,"Enkeltbokse - sygdomsbehandling -  min. 12 m2/ungdyr",30900,{"$f":"VLOOKUP(E17,Renovering!E:G,3,0)","v":"Ungdyrsplads"},null,null,null,null,null,null,null,null,null,null,null,0,null,null,null,null,null,0,null,null,null,null,"Opdræt",{"$f":"SUM(H14:H17)*Forside!E18","v":0},{"$f":"Forside!G18","v":950},0]
[null,null,null,null,"Ekstra staldkvadratmeter – Opsamlingsplads",2100,{"$f":"VLOOKUP(E18,Renovering!E:G,3,0)","v":"m2"},null,null,null,null,null,null,null,null,null,null,null,0,null,null,null,null,null,0]
[null,null,null,null,"Ekstra staldkvadratmeter – Malkestald",3500,{"$f":"VLOOKUP(E19,Renovering!E:G,3,0)","v":"m2"},null,null,null,null,null,null,null,null,null,null,null,0,null,null,null,null,null,0]
[null,null,null,null,"Ekstra staldkvadratmeter – Servicerum",5000,{"$f":"VLOOKUP(E20,Renovering!E:G,3,0)","v":"m2"},null,null,null,null,null,null,null,null,null,null,null,0,null,null,null,null,null,0]
[null,null,null,null,"Samlet pris for Basis Staldanlæg",null,null,null,null,null,null,null,null,null,null,null,null,null,null,null,null,null,null,null,{"$f":"SUMIF(Y7:Y20,\"<>Ikke relevant\",Y7:Y20)","v":0},null,null,null,null,"Total pris for ansøgningen"]
[null,null,null,null,null,null,null,null,null,null,null,null,null,null,null,null,null,null,null,null,null,null,null,null,null,null,null,null,null,null,null,null,"Værdier"]
[null,null,null,null,null,null,null,null,null,null,null,null,null,null,null,null,null,null,null,null,null,null,null,null,null,null,null,null,null,"Basis Staldanlæg",null,{"$f":"Y21","v":0},"Standardværdi",{"$f":"SUM(AG15:AG17)","v":0}]
[null,null,null,null,null,null,null,null,null,null,null,null,null,null,null,null,null,null,null,null,null,null,null,null,null,null,null,null,null,"Miljø- og dyrevelfærdstilkøb",null,{"$f":"Y42","v":0},"Tilkøb køer",{"$f":"W42","v":0}]
[null,"Elementernes anvendelse",null,null,"Miljø- og dyrevelfærdstilkøb",null,null,null,null,null,null,null,null,null,null,null,null,null,null,null,null,null,null,null,null,null,null,null,null,"Malkning og mælkeopbevaring",null,{"$f":"Y51","v":0},"Tilkøb ungdyr",{"$f":"X42","v":0}]
[null,"Malkekøer","Slagtekalve","Opdræt","Kategori/element","Pris","Enhed","Angiv Stk.","Enheder pr. koplads","Enheder pr. Slagtekalve","Enheder pr. Opdræt","100 Opnåelse","Procent af malkekøer dækket","Procent af slagtekalve dækket","Procent af opdræt dækket","Malkekøer dækket","Slagtekalve dækket","Opdræt dækket","Total Pris","Angiv lavere pris","Forøgelse i produktion Køer","Forøgelse i produktion ungdyr","Forøget værdi Køer(Forøgelse * Værdi)","Forøget værdi ungdyr(Forøgelse * Værdi)","Endelig pris til prioritering",null,null,null,null,"Samlet Pris",null,{"$f":"SUM(AF23:AF25)","v":0},"Total",{"$f":"SUM(AH23:AH25)","v":0}]
[null,"X","X","X","Forsuringsanlæg",700000,{"$f":"VLOOKUP(E27,Renovering!E:G,3,0)","v":"Stk."},null,450,2200,1250,{"$f":"IFERROR($AE$15/I27,0)+IFERROR($AE$16/J27,0)+IFERROR($AE$17/K27,0)","v":0},{"$f":"IF(L27=0,0,IF((H27/L27)>1,1,(H27/L27)))","v":0},{"$f":"IF(L27=0,0,IF((H27/L27)>1,1,(H27/L27)))","v":0},{"$f":"IF(L27=0,0,IF((H27/L27)>1,1,(H27/L27)))","v":0},{"$f":"IF($AE$15=0,0,M27*$AE$15)","v":0},{"$f":"IF($AE$16=0,0,N27*$AE$16)","v":0},{"$f":"IF($AE$17=0,0,O27*$AE$17)","v":0},{"$f":"IF(F27=\"Ikke Relevant\",\"Ikke Relevant\",F27*H27)","v":0},null,0.05,0.05,{"$f":"IF(OR(H27=0,H27=\"\"),0,U27*SUM($AG$15)*M27)","v":0},{"$f":"IF(OR(S27=0,S27=\"\"),0,V27*SUM($AG$16)*N27+V27*SUM($AG$17)*O27)","v":0},{"$f":"IF(AND(T27<S27,T27<>0,T27<>\"\"),T27,S27)","v":0},null,null,null,null,"Ansøgt Beløb (20%)",null,{"$f":"AF26/5","v":0}]
[null,"X",null,"X","Sandvasker",1100000,{"$f":"VLOOKUP(E28,Renovering!E:G,3,0)","v":"Stk."},null,{"$f":"SUM(AE15:AE17)","v":0},"Ikke relevant",1000,{"$f":"IFERROR($AE$15/I28,0)+IFERROR($AE$16/J28,0)+IFERROR($AE$17/K28,0)","v":0},{"$f":"IF(L28=0,0,IF((H28/L28)>1,1,(H28/L28)))","v":0},{"$f":"IF(L28=0,0,IF((H28/L28)>1,1,(H28/L28)))","v":0},{"$f":"IF(L28=0,0,IF((H28/L28)>1,1,(H28/L28)))","v":0},0,0,0,{"$f":"IF(F28=\"Ikke Relevant\",\"Ikke Relevant\",F28*H28)","v":0},null,0.05,0.05,0,0,0]
[null,"X","X","X","Ensilagesiloer – 22 m3 pr. ko og 13 m3 pr. kvie",275,{"$f":"VLOOKUP(E29,Renovering!E:G,3,0)","v":"m3"},null,{"$f":"1/22","v":4.5454545454545456E-2},{"$f":"1/3.5","v":0.2857142857142857},{"$f":"1/13","v":7.6923076923076927E-2},0,0,0,0,0,0,0,0,null,0.05,0.05,0,0,0,null,null,null,null,"Ansøgningens økonomiske effekt /\nAnsøgningens samlede score:",null,{"$f":"AH26/AF27","v":{"$error":"#DIV/0!"}}]
[null,"X","X","X","Gyllebeholder",140,{"$f":"VLOOKUP(E30,Renovering!E:G,3,0)","v":"m3"},null,{"$f":"1/23","v":4.3478260869565216E-2},0.2,0.2,0,0,0,0,0,0,0,0,null,0,0,0,0,0]
{"$rows_left_out":21}